Reaction Details
TargetCoagulation factor X
LigandBDBM50067522
Substrate/Competitorn/a
Meas. Tech.ChEMBL_48482 (CHEMBL662060)
Ki 530±n/a nM
Citation Gabriel, BStubbs, MTBergner, AHauptmann, JBode, WStürzebecher, JMoroder, L Design of benzamidine-type inhibitors of factor Xa. J Med Chem41:4240-50 (1998) 
 
Coagulation factor X
Name:Coagulation factor X
Type:PROTEIN
Mol. Mass.:54498.45
Organism:Bos taurus
Description:ChEMBL_1364435
Residue:492
BDBM50067522
NameBDBM50067522
Synonyms:2-[2-(4-Carbamimidoyl-benzenesulfonylamino)-acetylamino]-3-(4-carbamimidoyl-phenyl)-propionic acid ethyl ester | CHEMBL135815
TypeSmall organic molecule
Emp. Form.C21H26N6O5S
Mol. Mass.474.533
SMILESCCOC(=O)C(Cc1ccc(cc1)C(N)=N)NC(=O)CNS(=O)(=O)c1ccc(cc1)C(N)=N