Reaction Details
TargetVitamin K-dependent protein C
LigandBDBM50067527
Substrate/Competitorn/a
Meas. Tech.ChEMBL_27848 (CHEMBL642273)
Ki>1000000±n/a nM
Citation Gabriel, BStubbs, MTBergner, AHauptmann, JBode, WStürzebecher, JMoroder, L Design of benzamidine-type inhibitors of factor Xa. J Med Chem41:4240-50 (1998) 
 
Vitamin K-dependent protein C
Name:Vitamin K-dependent protein C
Type:Enzyme
Mol. Mass.:52067.73
Organism:Homo sapiens (Human)
Description:n/a
Residue:461
BDBM50067527
NameBDBM50067527
Synonyms:3-(4-Carbamimidoyl-phenyl)-2-[2-(4-thiocarbamoyl-benzenesulfonylamino)-acetylamino]-propionic acid ethyl ester | CHEMBL137311
TypeSmall organic molecule
Emp. Form.C21H25N5O5S2
Mol. Mass.491.584
SMILESCCOC(=O)C(Cc1ccc(cc1)C(N)=N)NC(=O)CNS(=O)(=O)c1ccc(cc1)C(N)=S