Reaction Details
TargetProthrombin
LigandBDBM50067524
Substrate/Competitorn/a
Meas. Tech.ChEMBL_210593 (CHEMBL816560)
Ki 15000±n/a nM
Citation Gabriel, BStubbs, MTBergner, AHauptmann, JBode, WStürzebecher, JMoroder, L Design of benzamidine-type inhibitors of factor Xa. J Med Chem41:4240-50 (1998) 
 
Prothrombin
Name:Prothrombin
Type:Enzyme
Mol. Mass.:70502.73
Organism:Bos taurus (Bovine)
Description:P00735
Residue:625
BDBM50067524
NameBDBM50067524
Synonyms:3-(3-Carbamimidoyl-phenyl)-2-[2-(4-cyano-benzenesulfonylamino)-acetylamino]-propionic acid ethyl ester | CHEMBL135998
TypeSmall organic molecule
Emp. Form.C21H23N5O5S
Mol. Mass.457.503
SMILESCCOC(=O)C(Cc1cccc(c1)C(N)=N)NC(=O)CNS(=O)(=O)c1ccc(cc1)C#N