Reaction Details
TargetPotassium voltage-gated channel subfamily A member 2
LigandBDBM50067878
Substrate/Competitorn/a
Meas. Tech.ChEMBL_92807 (CHEMBL703985)
Kd 590000±n/a nM
Citation Wulff, HRauer, HDüring, THanselmann, CRuff, KWrisch, AGrissmer, SHänsel, W Alkoxypsoralens, novel nonpeptide blockers of Shaker-type K+ channels: synthesis and photoreactivity. J Med Chem41:4542-9 (1998) 
 
Potassium voltage-gated channel subfamily A member 2
Name:Potassium voltage-gated channel subfamily A member 2
Type:PROTEIN
Mol. Mass.:56695.97
Organism:Homo sapiens (Human)
Description:ChEMBL_334898
Residue:499
BDBM50067878
NameBDBM50067878
Synonyms:9-Methoxy-furo[3',2':4,5]benzo[1,2-b][1,4]oxazin-3-one | CHEMBL141623
TypeSmall organic molecule
Emp. Form.C11H7NO4
Mol. Mass.217.1776
SMILESCOc1c2ccoc2cc2oc(=O)cnc12