Reaction Details
TargetPotassium voltage-gated channel subfamily A member 3
LigandBDBM50067880
Substrate/Competitorn/a
Meas. Tech.ChEMBL_91591 (CHEMBL703395)
Kd 101000±n/a nM
Citation Wulff, HRauer, HDüring, THanselmann, CRuff, KWrisch, AGrissmer, SHänsel, W Alkoxypsoralens, novel nonpeptide blockers of Shaker-type K+ channels: synthesis and photoreactivity. J Med Chem41:4542-9 (1998) 
 
Potassium voltage-gated channel subfamily A member 3
Name:Potassium voltage-gated channel subfamily A member 3
Type:PROTEIN
Mol. Mass.:58553.58
Organism:Mus musculus
Description:ChEMBL_1513943
Residue:528
BDBM50067880
NameBDBM50067880
Synonyms:4-methoxy-7H-furo[3,2-g][1]benzopyran-7-one 5-methoxypsoralen Bergaptene Heraclin | Majudin
TypeSmall organic molecule
Emp. Form.C12H8O4
Mol. Mass.216.1895
SMILESCOc1c2ccoc2cc2oc(=O)ccc12