Reaction Details
TargetPotassium voltage-gated channel subfamily A member 2
LigandBDBM50067880
Substrate/Competitorn/a
Meas. Tech.ChEMBL_92807 (CHEMBL703985)
Kd 41000±n/a nM
Citation Wulff, HRauer, HDüring, THanselmann, CRuff, KWrisch, AGrissmer, SHänsel, W Alkoxypsoralens, novel nonpeptide blockers of Shaker-type K+ channels: synthesis and photoreactivity. J Med Chem41:4542-9 (1998) 
 
Potassium voltage-gated channel subfamily A member 2
Name:Potassium voltage-gated channel subfamily A member 2
Type:PROTEIN
Mol. Mass.:56695.97
Organism:Homo sapiens (Human)
Description:ChEMBL_334898
Residue:499
BDBM50067880
NameBDBM50067880
Synonyms:4-methoxy-7H-furo[3,2-g][1]benzopyran-7-one 5-methoxypsoralen Bergaptene Heraclin | Majudin
TypeSmall organic molecule
Emp. Form.C12H8O4
Mol. Mass.216.1895
SMILESCOc1c2ccoc2cc2oc(=O)ccc12