Reaction Details
TargetPotassium voltage-gated channel subfamily A member 2
LigandBDBM50067881
Substrate/Competitorn/a
Meas. Tech.ChEMBL_92807 (CHEMBL703985)
Kd 23000±n/a nM
Citation Wulff, HRauer, HDüring, THanselmann, CRuff, KWrisch, AGrissmer, SHänsel, W Alkoxypsoralens, novel nonpeptide blockers of Shaker-type K+ channels: synthesis and photoreactivity. J Med Chem41:4542-9 (1998) 
 
Potassium voltage-gated channel subfamily A member 2
Name:Potassium voltage-gated channel subfamily A member 2
Type:PROTEIN
Mol. Mass.:56695.97
Organism:Homo sapiens (Human)
Description:ChEMBL_334898
Residue:499
BDBM50067881
NameBDBM50067881
Synonyms:4,9-Diethoxy-furo[3,2-g]chromen-7-one | CHEMBL342911
TypeSmall organic molecule
Emp. Form.C15H14O5
Mol. Mass.274.2687
SMILESCCOc1c2ccoc2c(OCC)c2oc(=O)ccc12