Reaction Details
TargetPotassium voltage-gated channel subfamily A member 5
LigandBDBM50067880
Substrate/Competitorn/a
Meas. Tech.ChEMBL_92809 (CHEMBL702905)
Kd 177000±n/a nM
Citation Wulff, HRauer, HDüring, THanselmann, CRuff, KWrisch, AGrissmer, SHänsel, W Alkoxypsoralens, novel nonpeptide blockers of Shaker-type K+ channels: synthesis and photoreactivity. J Med Chem41:4542-9 (1998) 
 
Potassium voltage-gated channel subfamily A member 5
Name:Potassium voltage-gated channel subfamily A member 5
Type:Enzyme
Mol. Mass.:67222.47
Organism:Homo sapiens (Human)
Description:P22460
Residue:613
BDBM50067880
NameBDBM50067880
Synonyms:4-methoxy-7H-furo[3,2-g][1]benzopyran-7-one 5-methoxypsoralen Bergaptene Heraclin | Majudin
TypeSmall organic molecule
Emp. Form.C12H8O4
Mol. Mass.216.1895
SMILESCOc1c2ccoc2cc2oc(=O)ccc12