Reaction Details
TargetSubstance-P receptor
LigandBDBM50067935
Substrate/Competitorn/a
Meas. Tech.ChEMBL_205708 (CHEMBL807955)
IC50 0.14±n/a nM
Citation Hale, JJMills, SGMacCoss, MFinke, PECascieri, MASadowski, SBer, EChicchi, GGKurtz, MMetzger, JEiermann, GTsou, NNTattersall, FDRupniak, NMWilliams, ARRycroft, WHargreaves, RMacIntyre, DE Structural optimization affording 2-(R)-(1-(R)-3, 5-bis(trifluoromethyl)phenylethoxy)-3-(S)-(4-fluoro)phenyl-4- (3-oxo-1,2,4-triazol-5-yl)methylmorpholine, a potent, orally active, long-acting morpholine acetal human NK-1 receptor antagonist. J Med Chem41:4607-14 (1998) 
 
Substance-P receptor
Name:Substance-P receptor
Type:G Protein-Coupled Receptor (GPCR)
Mol. Mass.:46254.43
Organism:Homo sapiens (Human)
Description:P25103
Residue:407
BDBM50067935
NameBDBM50067935
Synonyms:(2-Methoxy-5-trifluoromethoxy-benzyl)-((2S,3S)-2-phenyl-piperidin-3-yl)-amine CHEMBL319118 | CP-122721
TypeSmall organic molecule
Emp. Form.C20H23F3N2O2
Mol. Mass.380.404
SMILESCOc1ccc(OC(F)(F)F)cc1CN[C@H]1CCCN[C@H]1c1ccccc1