Reaction Details
TargetDelta-type opioid receptor
LigandBDBM50084127
Substrate/Competitorn/a
Meas. Tech.ChEMBL_124881 (CHEMBL731341)
EC50 1.8±n/a nM
Citation Liao, SAlfaro-Lopez, JShenderovich, MDHosohata, KLin, JLi, XStropova, DDavis, PJernigan, KAPorreca, FYamamura, HIHruby, VJ De novo design, synthesis, and biological activities of high-affinity and selective non-peptide agonists of the delta-opioid receptor. J Med Chem41:4767-76 (1998) 
 
Delta-type opioid receptor
Name:Delta-type opioid receptor
Type:Enzyme Catalytic Domain
Mol. Mass.:40577.25
Organism:MOUSE
Description:P32300
Residue:372
BDBM50084127
NameBDBM50084127
Synonyms:(4S,7S,13S)-13-[(2S,3R)-2-Amino-3-(4-hydroxy-2,6-dimethyl-phenyl)-butyrylamino]-7-benzyl-3,3,14,14-tetramethyl-6,9,12-trioxo-1,2-dithia-5,8,11-triaza-cyclotetradecane-4-carboxylic acid | CHEMBL150625
TypeSmall organic molecule
Emp. Form.C33H45N5O7S2
Mol. Mass.687.87
SMILESC[C@@H]([C@H](N)C(=O)N[C@H]1C(=O)NCC(=O)N[C@@H](Cc2ccccc2)C(=O)N[C@@H](C(O)=O)C(C)(C)SSC1(C)C)c1c(C)cc(O)cc1C