Reaction Details
TargetDelta-type opioid receptor
LigandBDBM50068132
Substrate/Competitorn/a
Meas. Tech.ChEMBL_124881 (CHEMBL731341)
EC50 210±n/a nM
Citation Liao, SAlfaro-Lopez, JShenderovich, MDHosohata, KLin, JLi, XStropova, DDavis, PJernigan, KAPorreca, FYamamura, HIHruby, VJ De novo design, synthesis, and biological activities of high-affinity and selective non-peptide agonists of the delta-opioid receptor. J Med Chem41:4767-76 (1998) 
 
Delta-type opioid receptor
Name:Delta-type opioid receptor
Type:Enzyme Catalytic Domain
Mol. Mass.:40577.25
Organism:MOUSE
Description:P32300
Residue:372
BDBM50068132
NameBDBM50068132
Synonyms:3-[(4-Benzyl-piperazin-1-yl)-(4-tert-butyl-phenyl)-methyl]-phenol SL-3111
TypeSmall organic molecule
Emp. Form.C28H34N2O
Mol. Mass.414.5824
SMILESCC(C)(C)c1ccc(cc1)C(N1CCN(Cc2ccccc2)CC1)c1cccc(O)c1