Reaction Details
TargetNeutrophil elastase
LigandBDBM50068280
Substrate/Competitorn/a
Meas. Tech.ChEMBL_96630 (CHEMBL705702)
IC50 1440±n/a nM
Citation Combrink, KDGülgeze, HBMeanwell, NAPearce, BCZulan, PBisacchi, GSRoberts, DGStanley, PSeiler, SM 1,2-Benzisothiazol-3-one 1,1-dioxide inhibitors of human mast cell tryptase. J Med Chem41:4854-60 (1998) 
 
Neutrophil elastase
Name:Neutrophil elastase
Type:Enzyme
Mol. Mass.:28532.38
Organism:Homo sapiens (Human)
Description:P08246
Residue:267
BDBM50068280
NameBDBM50068280
Synonyms:5-Benzyloxycarbonylamino-pentanoic acid 1,1,3-trioxo-1,3-dihydro-1lambda*6*-benzo[d]isothiazol-2-ylmethyl ester | CHEMBL341885
TypeSmall organic molecule
Emp. Form.C21H22N2O7S
Mol. Mass.446.474
SMILESO=C(CCCCNC(=O)OCc1ccccc1)OCN1C(=O)c2ccccc2S1(=O)=O