Reaction Details
TargetTelomerase reverse transcriptase
LigandBDBM50068335
Substrate/Competitorn/a
Meas. Tech.ChEMBL_210069 (CHEMBL813593)
IC50 4400±n/a nM
Citation Perry, PJReszka, APWood, AARead, MAGowan, SMDosanjh, HSTrent, JOJenkins, TCKelland, LRNeidle, S Human telomerase inhibition by regioisomeric disubstituted amidoanthracene-9,10-diones. J Med Chem41:4873-84 (1998) 
 
Telomerase reverse transcriptase
Name:Telomerase reverse transcriptase
Type:PROTEIN
Mol. Mass.:127099.03
Organism:Homo sapiens (Human)
Description:ChEMBL_1447029
Residue:1132
BDBM50068335
NameBDBM50068335
Synonyms:CHEMBL422120 | N-[9,10-Dioxo-8-(3-(N,N,N-trimethyl-propionylamino)-9,10-dihydro-anthracen-1-yl]-3-(N,N,N-trimethyl)-propionamide; diiodide
TypeSmall organic molecule
Emp. Form.C26H34N4O4
Mol. Mass.466.5715
SMILESC[N+](C)(C)CCC(=O)Nc1cccc2C(=O)c3cccc(NC(=O)CC[N+](C)(C)C)c3C(=O)c12