Reaction Details
TargetD(4) dopamine receptor
LigandBDBM85093
Substrate/Competitorn/a
Meas. Tech.ChEMBL_60814 (CHEMBL674966)
Ki 0.43±n/a nM
Citation Perrone, RBerardi, FColabufo, NALeopoldo, MTortorella, V N-[2-[4-(4-Chlorophenyl)piperazin-1-yl]ethyl]-3-methoxybenzamide: a potent and selective dopamine D4 ligand. J Med Chem41:4903-9 (1998) 
 
D(4) dopamine receptor
Name:D(4) dopamine receptor
Type:Enzyme
Mol. Mass.:48373.19
Organism:Homo sapiens (Human)
Description:P21917
Residue:419
BDBM85093
NameBDBM85093
Synonyms:CAS_3853 CHEMBL555670 NSC_3853
TypeSmall organic molecule
Emp. Form.C18H19ClN4
Mol. Mass.326.823
SMILESClc1ccc(cc1)N1CCN(Cc2c[nH]c3ncccc23)CC1