Reaction Details
Target5-hydroxytryptamine receptor 2C
LigandBDBM50068514
Substrate/Competitorn/a
Meas. Tech.ChEMBL_2968 (CHEMBL617908)
Ki 1.9±n/a nM
Citation Vangveravong, SKanthasamy, ALucaites, VLNelson, DLNichols, DE Synthesis and serotonin receptor affinities of a series of trans-2-(indol-3-yl)cyclopropylamine derivatives. J Med Chem41:4995-5001 (1999) 
 
5-hydroxytryptamine receptor 2C
Name:5-hydroxytryptamine receptor 2C
Type:G Protein-Coupled Receptor (GPCR)
Mol. Mass.:51836.79
Organism:Homo sapiens (Human)
Description:P28335
Residue:458
BDBM50068514
NameBDBM50068514
Synonyms:2-(5-Fluoro-1H-indol-3-yl)-cyclopropylamine | CHEMBL147656
TypeSmall organic molecule
Emp. Form.C11H11FN2
Mol. Mass.190.2168
SMILESNC1CC1c1c[nH]c2ccc(F)cc12