Reaction Details
Target5-hydroxytryptamine receptor 2A
LigandBDBM50068525
Substrate/Competitorn/a
Meas. Tech.ChEMBL_2658 (CHEMBL618907)
Ki 6±n/a nM
Citation Metwally, KADukat, MEgan, CTSmith, CDuPre, AGauthier, CBHerrick-Davis, KTeitler, MGlennon, RA Spiperone: influence of spiro ring substituents on 5-HT2A serotonin receptor binding. J Med Chem41:5084-93 (1999) 
 
5-hydroxytryptamine receptor 2A
Name:5-hydroxytryptamine receptor 2A
Type:G Protein-Coupled Receptor (GPCR)
Mol. Mass.:52852.05
Organism:Rattus norvegicus (rat)
Description:Rat cortex membranes 5-HT2A receptors.
Residue:471
BDBM50068525
NameBDBM50068525
Synonyms:4-Cyclohexylamino-1-[4-(4-fluoro-phenyl)-4-oxo-butyl]-piperidine-4-carboxylic acid amide | CHEMBL356075
TypeSmall organic molecule
Emp. Form.C22H32FN3O2
Mol. Mass.389.5068
SMILESNC(=O)C1(CCN(CCCC(=O)c2ccc(F)cc2)CC1)NC1CCCCC1