Reaction Details
Target5-hydroxytryptamine receptor 2A
LigandBDBM50068530
Substrate/Competitorn/a
Meas. Tech.ChEMBL_2658 (CHEMBL618907)
Ki 0.7±n/a nM
Citation Metwally, KADukat, MEgan, CTSmith, CDuPre, AGauthier, CBHerrick-Davis, KTeitler, MGlennon, RA Spiperone: influence of spiro ring substituents on 5-HT2A serotonin receptor binding. J Med Chem41:5084-93 (1999) 
 
5-hydroxytryptamine receptor 2A
Name:5-hydroxytryptamine receptor 2A
Type:G Protein-Coupled Receptor (GPCR)
Mol. Mass.:52852.05
Organism:Rattus norvegicus (rat)
Description:Rat cortex membranes 5-HT2A receptors.
Residue:471
BDBM50068530
NameBDBM50068530
Synonyms:1-Cyclohexyl-8-[4-(4-fluoro-phenyl)-4-oxo-butyl]-1,3,8-triaza-spiro[4.5]decan-4-one | CHEMBL147449
TypeSmall organic molecule
Emp. Form.C23H32FN3O2
Mol. Mass.401.5175
SMILESFc1ccc(cc1)C(=O)CCCN1CCC2(CC1)N(CNC2=O)C1CCCCC1