Reaction Details
Target5-hydroxytryptamine receptor 2A
LigandBDBM50052337
Substrate/Competitorn/a
Meas. Tech.ChEMBL_2287 (CHEMBL617072)
Ki 0.48±n/a nM
Citation Parker, MAMarona-Lewicka, DLucaites, VLNelson, DLNichols, DE A novel (benzodifuranyl)aminoalkane with extremely potent activity at the 5-HT2A receptor. J Med Chem41:5148-9 (1999) 
 
5-hydroxytryptamine receptor 2A
Name:5-hydroxytryptamine receptor 2A
Type:undefined
Mol. Mass.:52607.65
Organism:Homo sapiens (Human)
Description:P28223
Residue:471
BDBM50052337
NameBDBM50052337
Synonyms:2-(8-bromo-2,3,6,7-tetrahydro-benzo[1,2-b;4,5-b']difuran-4-yl)-1-methyl-ethylamine | CHEMBL101008
TypeSmall organic molecule
Emp. Form.C13H16BrNO2
Mol. Mass.298.176
SMILESCC(N)Cc1c2CCOc2c(Br)c2CCOc12