Reaction Details
Target5-hydroxytryptamine receptor 2A
LigandBDBM50068612
Substrate/Competitorn/a
Meas. Tech.ChEMBL_2611 (CHEMBL617479)
Ki 0.23±n/a nM
Citation Parker, MAMarona-Lewicka, DLucaites, VLNelson, DLNichols, DE A novel (benzodifuranyl)aminoalkane with extremely potent activity at the 5-HT2A receptor. J Med Chem41:5148-9 (1999) 
 
5-hydroxytryptamine receptor 2A
Name:5-hydroxytryptamine receptor 2A
Type:G Protein-Coupled Receptor (GPCR)
Mol. Mass.:52852.05
Organism:Rattus norvegicus (rat)
Description:Rat cortex membranes 5-HT2A receptors.
Residue:471
BDBM50068612
NameBDBM50068612
Synonyms:2-(8-Bromo-benzo[1,2-b;4,5-b']difuran-4-yl)-1-methyl-ethylamine | CHEMBL149024
TypeSmall organic molecule
Emp. Form.C13H12BrNO2
Mol. Mass.294.144
SMILESCC(N)Cc1c2ccoc2c(Br)c2ccoc12