Reaction Details
Target5-hydroxytryptamine receptor 2C
LigandBDBM50052337
Substrate/Competitorn/a
Meas. Tech.ChEMBL_2967 (CHEMBL617907)
Ki 0.3±n/a nM
Citation Parker, MAMarona-Lewicka, DLucaites, VLNelson, DLNichols, DE A novel (benzodifuranyl)aminoalkane with extremely potent activity at the 5-HT2A receptor. J Med Chem41:5148-9 (1999) 
 
5-hydroxytryptamine receptor 2C
Name:5-hydroxytryptamine receptor 2C
Type:G Protein-Coupled Receptor (GPCR)
Mol. Mass.:51836.79
Organism:Homo sapiens (Human)
Description:P28335
Residue:458
BDBM50052337
NameBDBM50052337
Synonyms:2-(8-bromo-2,3,6,7-tetrahydro-benzo[1,2-b;4,5-b']difuran-4-yl)-1-methyl-ethylamine | CHEMBL101008
TypeSmall organic molecule
Emp. Form.C13H16BrNO2
Mol. Mass.298.176
SMILESCC(N)Cc1c2CCOc2c(Br)c2CCOc12