Reaction Details
TargetAlpha-1B adrenergic receptor
LigandBDBM29568
Substrate/Competitorn/a
Meas. Tech.ChEMBL_34639 (CHEMBL647284)
Ki 0.550000±n/a nM
Citation Nagarathnam, DWetzel, JMMiao, SWMarzabadi, MRChiu, GWong, WCHong, XFang, JForray, CBranchek, TAHeydorn, WEChang, RSBroten, TSchorn, TWGluchowski, C Design and synthesis of novel alpha1a adrenoceptor-selective dihydropyridine antagonists for the treatment of benign prostatic hyperplasia. J Med Chem41:5320-33 (1999) 
 
Alpha-1B adrenergic receptor
Name:Alpha-1B adrenergic receptor
Type:Enzyme
Mol. Mass.:56862.13
Organism:Homo sapiens (Human)
Description:P35368
Residue:520
BDBM29568
NameBDBM29568
Synonyms:CHEMBL2 PRAZOSIN HYDROCHLORIDE [3H]-Minipress [3H]-Prazosin
Typeradiolabeled ligand
Emp. Form.C19H21N5O4
Mol. Mass.383.4011
SMILESCOc1cc2nc(nc(N)c2cc1OC)N1CCN(CC1)C(=O)c1ccco1