Reaction Details
TargetAlpha-1B adrenergic receptor
LigandBDBM50068833
Substrate/Competitorn/a
Meas. Tech.ChEMBL_34639 (CHEMBL647284)
Ki 3070±n/a nM
Citation Nagarathnam, DWetzel, JMMiao, SWMarzabadi, MRChiu, GWong, WCHong, XFang, JForray, CBranchek, TAHeydorn, WEChang, RSBroten, TSchorn, TWGluchowski, C Design and synthesis of novel alpha1a adrenoceptor-selective dihydropyridine antagonists for the treatment of benign prostatic hyperplasia. J Med Chem41:5320-33 (1999) 
 
Alpha-1B adrenergic receptor
Name:Alpha-1B adrenergic receptor
Type:Enzyme
Mol. Mass.:56862.13
Organism:Homo sapiens (Human)
Description:P35368
Residue:520
BDBM50068833
NameBDBM50068833
Synonyms:1-(3-{[5-Ethylcarbamoyl-2,6-dimethyl-4-(4-nitro-phenyl)-1,4-dihydro-pyridine-3-carbonyl]-amino}-propyl)-4-phenyl-piperidine-4-carboxylic acid methyl ester | CHEMBL357681
TypeSmall organic molecule
Emp. Form.C33H41N5O6
Mol. Mass.603.7085
SMILESCCNC(=O)C1C(C(C(=O)NCCCN2CCC(CC2)(C(=O)OC)c2ccccc2)=C(C)N=C1C)c1ccc(cc1)[N+]([O-])=O