Reaction Details
TargetAlpha-1B adrenergic receptor
LigandBDBM50068822
Substrate/Competitorn/a
Meas. Tech.ChEMBL_34639 (CHEMBL647284)
Ki 24400±n/a nM
Citation Nagarathnam, DWetzel, JMMiao, SWMarzabadi, MRChiu, GWong, WCHong, XFang, JForray, CBranchek, TAHeydorn, WEChang, RSBroten, TSchorn, TWGluchowski, C Design and synthesis of novel alpha1a adrenoceptor-selective dihydropyridine antagonists for the treatment of benign prostatic hyperplasia. J Med Chem41:5320-33 (1999) 
 
Alpha-1B adrenergic receptor
Name:Alpha-1B adrenergic receptor
Type:Enzyme
Mol. Mass.:56862.13
Organism:Homo sapiens (Human)
Description:P35368
Residue:520
BDBM50068822
NameBDBM50068822
Synonyms:2,6-Dimethyl-4-(4-nitro-phenyl)-1,4-dihydro-pyridine-3,5-dicarboxylic acid 3-amide 5-{[3-(4-dimethylcarbamoyl-4-phenyl-piperidin-1-yl)-propyl]-amide} | CHEMBL150696
TypeSmall organic molecule
Emp. Form.C32H40N6O5
Mol. Mass.588.6972
SMILESCN(C)C(=O)C1(CCN(CCCNC(=O)C2=C(C)N=C(C)C(C2c2ccc(cc2)[N+]([O-])=O)C(N)=O)CC1)c1ccccc1