Reaction Details
TargetAlpha-1B adrenergic receptor
LigandBDBM50068837
Substrate/Competitorn/a
Meas. Tech.ChEMBL_34639 (CHEMBL647284)
Ki 5500±n/a nM
Citation Nagarathnam, DWetzel, JMMiao, SWMarzabadi, MRChiu, GWong, WCHong, XFang, JForray, CBranchek, TAHeydorn, WEChang, RSBroten, TSchorn, TWGluchowski, C Design and synthesis of novel alpha1a adrenoceptor-selective dihydropyridine antagonists for the treatment of benign prostatic hyperplasia. J Med Chem41:5320-33 (1999) 
 
Alpha-1B adrenergic receptor
Name:Alpha-1B adrenergic receptor
Type:Enzyme
Mol. Mass.:56862.13
Organism:Homo sapiens (Human)
Description:P35368
Residue:520
BDBM50068837
NameBDBM50068837
Synonyms:1-(3-{[5-Carbamoyl-2,6-dimethyl-4-(4-nitro-phenyl)-1,4-dihydro-pyridine-3-carbonyl]-amino}-propyl)-4-phenyl-piperidine-4-carboxylic acid 2-hydroxy-ethyl ester | CHEMBL356623
TypeSmall organic molecule
Emp. Form.C32H39N5O7
Mol. Mass.605.6814
SMILESCC1=NC(C)=C(C(C1C(N)=O)c1ccc(cc1)[N+]([O-])=O)C(=O)NCCCN1CCC(CC1)(C(=O)OCCO)c1ccccc1