Reaction Details
TargetAlpha-1A adrenergic receptor
LigandBDBM50068817
Substrate/Competitorn/a
Meas. Tech.ChEMBL_33615 (CHEMBL652822)
Ki 27±n/a nM
Citation Nagarathnam, DWetzel, JMMiao, SWMarzabadi, MRChiu, GWong, WCHong, XFang, JForray, CBranchek, TAHeydorn, WEChang, RSBroten, TSchorn, TWGluchowski, C Design and synthesis of novel alpha1a adrenoceptor-selective dihydropyridine antagonists for the treatment of benign prostatic hyperplasia. J Med Chem41:5320-33 (1999) 
 
Alpha-1A adrenergic receptor
Name:Alpha-1A adrenergic receptor
Type:Cell-surface receptors
Mol. Mass.:51511.67
Organism:Homo sapiens (Human)
Description:P35348
Residue:466
BDBM50068817
NameBDBM50068817
Synonyms:2,6-Dimethyl-4-(4-nitro-phenyl)-1,4-dihydro-pyridine-3,5-dicarboxylic acid 3-{[3-(4-acetyl-4-phenyl-piperidin-1-yl)-propyl]-amide} 5-amide | CHEMBL347522
TypeSmall organic molecule
Emp. Form.C31H37N5O5
Mol. Mass.559.656
SMILESCC(=O)C1(CCN(CCCNC(=O)C2=C(C)N=C(C)C(C2c2ccc(cc2)[N+]([O-])=O)C(N)=O)CC1)c1ccccc1