Reaction Details
Target5-hydroxytryptamine receptor 1D
LigandBDBM50068829
Substrate/Competitorn/a
Meas. Tech.ChEMBL_32426 (CHEMBL646088)
Ki 1850±n/a nM
Citation Nagarathnam, DWetzel, JMMiao, SWMarzabadi, MRChiu, GWong, WCHong, XFang, JForray, CBranchek, TAHeydorn, WEChang, RSBroten, TSchorn, TWGluchowski, C Design and synthesis of novel alpha1a adrenoceptor-selective dihydropyridine antagonists for the treatment of benign prostatic hyperplasia. J Med Chem41:5320-33 (1999) 
 
5-hydroxytryptamine receptor 1D
Name:5-hydroxytryptamine receptor 1D
Type:G Protein-Coupled Receptor (GPCR)
Mol. Mass.:41920.63
Organism:Homo sapiens (Human)
Description:Receptor binding assays were performed using human clone stably expressed in CHO cells.
Residue:377
BDBM50068829
NameBDBM50068829
Synonyms:5-[3-(4-Methoxycarbonyl-4-phenyl-piperidin-1-yl)-propylcarbamoyl]-2,6-dimethyl-4-(4-nitro-phenyl)-1,4-dihydro-pyridine-3-carboxylic acid 2-hydroxy-ethyl ester | CHEMBL347501
TypeSmall organic molecule
Emp. Form.C33H40N4O8
Mol. Mass.620.6927
SMILESCOC(=O)C1(CCN(CCCNC(=O)C2=C(C)N=C(C)C(C2c2ccc(cc2)[N+]([O-])=O)C(=O)OCCO)CC1)c1ccccc1