Reaction Details
Target5-hydroxytryptamine receptor 1D
LigandBDBM50068830
Substrate/Competitorn/a
Meas. Tech.ChEMBL_32426 (CHEMBL646088)
Ki 4990.0±n/a nM
Citation Nagarathnam, DWetzel, JMMiao, SWMarzabadi, MRChiu, GWong, WCHong, XFang, JForray, CBranchek, TAHeydorn, WEChang, RSBroten, TSchorn, TWGluchowski, C Design and synthesis of novel alpha1a adrenoceptor-selective dihydropyridine antagonists for the treatment of benign prostatic hyperplasia. J Med Chem41:5320-33 (1999) 
 
5-hydroxytryptamine receptor 1D
Name:5-hydroxytryptamine receptor 1D
Type:G Protein-Coupled Receptor (GPCR)
Mol. Mass.:41920.63
Organism:Homo sapiens (Human)
Description:Receptor binding assays were performed using human clone stably expressed in CHO cells.
Residue:377
BDBM50068830
NameBDBM50068830
Synonyms:1-(3-{[5-Carbamoyl-2,6-dimethyl-4-(4-nitro-phenyl)-1,4-dihydro-pyridine-3-carbonyl]-amino}-propyl)-4-phenyl-piperidine-4-carboxylic acid ethyl ester | CHEMBL151878
TypeSmall organic molecule
Emp. Form.C32H39N5O6
Mol. Mass.589.682
SMILESCCOC(=O)C1(CCN(CCCNC(=O)C2=C(C)N=C(C)C(C2c2ccc(cc2)[N+]([O-])=O)C(N)=O)CC1)c1ccccc1