Reaction Details
Target5-hydroxytryptamine receptor 1D
LigandBDBM50068818
Substrate/Competitorn/a
Meas. Tech.ChEMBL_1714 (CHEMBL872914)
Ki>5000±n/a nM
Citation Nagarathnam, DWetzel, JMMiao, SWMarzabadi, MRChiu, GWong, WCHong, XFang, JForray, CBranchek, TAHeydorn, WEChang, RSBroten, TSchorn, TWGluchowski, C Design and synthesis of novel alpha1a adrenoceptor-selective dihydropyridine antagonists for the treatment of benign prostatic hyperplasia. J Med Chem41:5320-33 (1999) 
 
5-hydroxytryptamine receptor 1D
Name:5-hydroxytryptamine receptor 1D
Type:G Protein-Coupled Receptor (GPCR)
Mol. Mass.:41920.63
Organism:Homo sapiens (Human)
Description:Receptor binding assays were performed using human clone stably expressed in CHO cells.
Residue:377
BDBM50068818
NameBDBM50068818
Synonyms:1-(3-{[2,6-Dimethyl-5-methylcarbamoyl-4-(4-nitro-phenyl)-1,4-dihydro-pyridine-3-carbonyl]-amino}-propyl)-4-phenyl-piperidine-4-carboxylic acid methyl ester | CHEMBL147077
TypeSmall organic molecule
Emp. Form.C32H39N5O6
Mol. Mass.589.682
SMILESCNC(=O)C1C(C(C(=O)NCCCN2CCC(CC2)(C(=O)OC)c2ccccc2)=C(C)N=C1C)c1ccc(cc1)[N+]([O-])=O