Reaction Details
TargetAlpha-1A adrenergic receptor
LigandBDBM50068839
Substrate/Competitorn/a
Meas. Tech.ChEMBL_33615 (CHEMBL652822)
Ki 0.84±n/a nM
Citation Nagarathnam, DWetzel, JMMiao, SWMarzabadi, MRChiu, GWong, WCHong, XFang, JForray, CBranchek, TAHeydorn, WEChang, RSBroten, TSchorn, TWGluchowski, C Design and synthesis of novel alpha1a adrenoceptor-selective dihydropyridine antagonists for the treatment of benign prostatic hyperplasia. J Med Chem41:5320-33 (1999) 
 
Alpha-1A adrenergic receptor
Name:Alpha-1A adrenergic receptor
Type:Cell-surface receptors
Mol. Mass.:51511.67
Organism:Homo sapiens (Human)
Description:P35348
Residue:466
BDBM50068839
NameBDBM50068839
Synonyms:1-(3-{[5-Carbamoyl-2,6-dimethyl-4-(4-nitro-phenyl)-1,4-dihydro-pyridine-3-carbonyl]-amino}-propyl)-4-phenyl-piperidine-4-carboxylic acid methyl ester | CHEMBL356829
TypeSmall organic molecule
Emp. Form.C31H37N5O6
Mol. Mass.575.6554
SMILESCOC(=O)C1(CCN(CCCNC(=O)C2=C(C)N=C(C)C(C2c2ccc(cc2)[N+]([O-])=O)C(N)=O)CC1)c1ccccc1