Reaction Details
TargetAlpha-1A adrenergic receptor
LigandBDBM50068826
Substrate/Competitorn/a
Meas. Tech.ChEMBL_33615 (CHEMBL652822)
Ki 4330±n/a nM
Citation Nagarathnam, DWetzel, JMMiao, SWMarzabadi, MRChiu, GWong, WCHong, XFang, JForray, CBranchek, TAHeydorn, WEChang, RSBroten, TSchorn, TWGluchowski, C Design and synthesis of novel alpha1a adrenoceptor-selective dihydropyridine antagonists for the treatment of benign prostatic hyperplasia. J Med Chem41:5320-33 (1999) 
 
Alpha-1A adrenergic receptor
Name:Alpha-1A adrenergic receptor
Type:Cell-surface receptors
Mol. Mass.:51511.67
Organism:Homo sapiens (Human)
Description:P35348
Residue:466
BDBM50068826
NameBDBM50068826
Synonyms:2,6-Dimethyl-4-(4-nitro-phenyl)-1,4-dihydro-pyridine-3,5-dicarboxylic acid 3-amide 5-[(3-piperidin-1-yl-propyl)-amide] | CHEMBL150743
TypeSmall organic molecule
Emp. Form.C23H31N5O4
Mol. Mass.441.5233
SMILESCC1=NC(C)=C(C(C1C(N)=O)c1ccc(cc1)[N+]([O-])=O)C(=O)NCCCN1CCCCC1