Reaction Details
TargetAlpha-1A adrenergic receptor
LigandBDBM50068836
Substrate/Competitorn/a
Meas. Tech.ChEMBL_33615 (CHEMBL652822)
Ki 2.88±n/a nM
Citation Nagarathnam, DWetzel, JMMiao, SWMarzabadi, MRChiu, GWong, WCHong, XFang, JForray, CBranchek, TAHeydorn, WEChang, RSBroten, TSchorn, TWGluchowski, C Design and synthesis of novel alpha1a adrenoceptor-selective dihydropyridine antagonists for the treatment of benign prostatic hyperplasia. J Med Chem41:5320-33 (1999) 
 
Alpha-1A adrenergic receptor
Name:Alpha-1A adrenergic receptor
Type:Cell-surface receptors
Mol. Mass.:51511.67
Organism:Homo sapiens (Human)
Description:P35348
Residue:466
BDBM50068836
NameBDBM50068836
Synonyms:2,6-Dimethyl-4-(4-nitro-phenyl)-1,4-dihydro-pyridine-3,5-dicarboxylic acid 3-amide 5-{[3-(4-cyano-4-phenyl-piperidin-1-yl)-propyl]-amide} | CHEMBL347559
TypeSmall organic molecule
Emp. Form.C30H34N6O4
Mol. Mass.542.6288
SMILESCC1=NC(C)=C(C(C1C(N)=O)c1ccc(cc1)[N+]([O-])=O)C(=O)NCCCN1CCC(CC1)(C#N)c1ccccc1