Reaction Details
TargetChymase
LigandBDBM50068912
Substrate/Competitorn/a
Meas. Tech.ChEBML_49443
Ki 14±n/a nM
Citation Eda, MAshimori, AAkahoshi, FYoshimura, TInoue, YFukaya, CNakajima, MFukuyama, HImada, TTakai, SShiota, NMiyazaki, MNakamura, N Peptidyl human heart chymase inhibitors. 2. Discovery of highly selective difluoromethylene ketone derivatives with Glu at P3 site. Bioorg Med Chem Lett8:919-24 (1999) Chymase
Name:Chymase
Type:Enzyme
Mol. Mass.:27340.12
Organism:Homo sapiens (Human)
Description:n/a
Residue:247
BDBM50068912
NameBDBM50068912
Synonyms:3-(4-{[(S)-1-(2-tert-Butoxycarbonylamino-4-carboxy-butyryl)-pyrrolidine-2-carbonyl]-amino}-2,2-difluoro-3-oxo-5-phenyl-pentanoylamino)-naphthalene-1-carboxylic acid | CHEMBL170152
TypeSmall organic molecule
Emp. Form.C37H40F2N4O10
Mol. Mass.738.7311
SMILESCC(C)(C)OC(=O)NC(CCC(O)=O)C(=O)N1CCC[C@H]1C(=O)NC(Cc1ccccc1)C(=O)C(F)(F)C(=O)Nc1cc(C(O)=O)c2ccccc2c1