Reaction Details
TargetCysteinyl leukotriene receptor 1
LigandBDBM50068974
Substrate/Competitorn/a
Meas. Tech.ChEBML_99998
IC50 6±n/a nM
Citation von Sprecher, AGerspacher, MBeck, AKimmel, SWiestner, HAnderson, GPNiederhauser, USubramanian, NBray, MA Synthesis and SAR of a novel, potent and structurally simple LTD4 antagonist of the quinoline class. Bioorg Med Chem Lett8:965-70 (1999) Cysteinyl leukotriene receptor 1
Name:Cysteinyl leukotriene receptor 1
Type:Enzyme Catalytic Domain
Mol. Mass.:39007.58
Organism:GUINEA PIG
Description:Leukotriene D4 0 GUINEA PIG::Q2NNR5
Residue:340
BDBM50068974
NameBDBM50068974
Synonyms:2,2-Diethyl-N-[3-(7-fluoro-quinolin-2-ylmethoxy)-phenyl]-succinamic acid CHEMBL178221
TypeSmall organic molecule
Emp. Form.C24H25FN2O4
Mol. Mass.424.4647
SMILESCCC(CC)(CC(=O)Nc1cccc(OCc2ccc3ccc(F)cc3n2)c1)C(O)=O