Reaction Details
TargetSerotonin 2 (5-HT2) receptor
LigandBDBM50069016
Substrate/Competitorn/a
Meas. Tech.ChEMBL_2347 (CHEMBL617421)
Ki 0.620000±n/a nM
Citation Maryanoff, BEMcComsey, DFMartin, GEShank, RP Azepinoindole derivatives with high affinity for brain dopamine and serotonin receptors. Bioorg Med Chem Lett8:983-8 (1999) Serotonin 2 (5-HT2) receptor
Name:Serotonin 2 (5-HT2) receptor
Synonyms:5-hydroxytryptamine receptor 2A/2B/2C
Type:n/a
Mol. Mass.:n/a
Description:ASSAY_ID of ChEMBL is 2197419
Components:This complex has 3 components.
Component 1
Name:5-hydroxytryptamine receptor 2B
Type:Enzyme Catalytic Domain
Mol. Mass.:53668.47
Organism:RAT
Description:5-HT2B HTR2B RAT::P30994
Residue:479
Component 2
Name:5-hydroxytryptamine receptor 2C
Synonyms:5-HT2C 5-hydroxytryptamine receptor 2C (5HT2c) 5ht1c Htr2c Serotonin receptor 2a and 2c (5HT2A and 5HT2C)
Type:Enzyme
Mol. Mass.:51935.10
Organism:Rattus norvegicus (Rat)
Description:P08909
Residue:460
Component 3
Name:5-hydroxytryptamine receptor 2A
Synonyms:5-HT-2A 5-HT2A 5-hydroxytryptamine receptor 2A (5HT2A) Htr2 Serotonin Receptor 2A
Type:G Protein-Coupled Receptor (GPCR)
Mol. Mass.:52852.05
Organism:Rattus norvegicus (rat)
Description:Rat cortex membranes 5-HT2A receptors.
Residue:471
BDBM50069016
NameBDBM50069016
Synonyms:1-(4-Fluoro-phenyl)-4-methyl-2,2a,3,4,5,6-hexahydro-1H-azepino[3,4,5-cd]indole | CHEMBL173315
TypeSmall organic molecule
Emp. Form.C18H19FN2
Mol. Mass.282.3553
SMILESCN1CCc2cccc3N(CC(C1)c23)c1ccc(F)cc1