Reaction Details
TargetLactoylglutathione lyase
LigandBDBM50069024
Substrate/Competitorn/a
Meas. Tech.ChEMBL_71304 (CHEMBL686107)
IC50 3900±n/a nM
Citation Ly, HDClugston, SLSampson, PBHonek, JF Syntheses and kinetic evaluation of hydroxamate-based peptide inhibitors of glyoxalase I. Bioorg Med Chem Lett8:705-10 (1999) Lactoylglutathione lyase
Name:Lactoylglutathione lyase
Type:Enzyme
Mol. Mass.:20772.95
Organism:Homo sapiens (Human)
Description:Q04760
Residue:184
BDBM50069024
NameBDBM50069024
Synonyms:2-Amino-4-[1-(carboxymethyl-carbamoyl)-3-(hydroxy-methyl-carbamoyl)-propylcarbamoyl]-butyric acid anion | CHEMBL159603
TypeSmall organic molecule
Emp. Form.C13H22N4O8
Mol. Mass.362.3358
SMILESCN(O)C(=O)CCC(NC(=O)CCC([NH3+])C([O-])=O)C(=O)NCC(O)=O