Reaction Details
TargetLactoylglutathione lyase
LigandBDBM50069025
Substrate/Competitorn/a
Meas. Tech.ChEMBL_71304 (CHEMBL686107)
IC50 209600±n/a nM
Citation Ly, HDClugston, SLSampson, PBHonek, JF Syntheses and kinetic evaluation of hydroxamate-based peptide inhibitors of glyoxalase I. Bioorg Med Chem Lett8:705-10 (1999) Lactoylglutathione lyase
Name:Lactoylglutathione lyase
Type:Enzyme
Mol. Mass.:20772.95
Organism:Homo sapiens (Human)
Description:Q04760
Residue:184
BDBM50069025
NameBDBM50069025
Synonyms:2-Amino-4-[1-(carboxymethyl-carbamoyl)-3-hydroxycarbamoyl-propylcarbamoyl]-butyric acid anion | CHEMBL164263
TypeSmall organic molecule
Emp. Form.C12H20N4O8
Mol. Mass.348.3092
SMILES[NH3+]C(CCC(=O)NC(CCC(=O)NO)C(=O)NCC(O)=O)C([O-])=O