Reaction Details
TargetGag-Pol polyprotein [489-587]
LigandBDBM50069029
Substrate/Competitorn/a
Meas. Tech.ChEBML_80095
Ki 0.041000±n/a nM
Citation Rodgers, JDJohnson, BLWang, HErickson-Viitanen, SKlabe, RMBacheler, LCordova, BCChang, CH Potent cyclic urea HIV protease inhibitors with 3-aminoindazole P2/P2' groups. Bioorg Med Chem Lett8:715-20 (1999) Gag-Pol polyprotein [489-587]
Name:Gag-Pol polyprotein [489-587]
Type:Enzyme Subunit
Mol. Mass.:10781.16
Organism:Human immunodeficiency virus type 1
Description:P04585[489-587]
Residue:99
BDBM50069029
NameBDBM50069029
Synonyms:(4R,5S,6S,7R)-4,7-Dibenzyl-1,3-bis-(3-ethylamino-1H-indazol-5-ylmethyl)-5,6-dihydroxy-[1,3]diazepan-2-one | CHEMBL351172
TypeSmall organic molecule
Emp. Form.C39H44N8O3
Mol. Mass.672.8185
SMILESCCNc1[nH]nc2ccc(CN3[C@H](Cc4ccccc4)[C@H](O)[C@@H](O)[C@@H](Cc4ccccc4)N(Cc4ccc5n[nH]c(NCC)c5c4)C3=O)cc12