Reaction Details
Target5-hydroxytryptamine receptor 1A
LigandBDBM50069041
Substrate/Competitorn/a
Meas. Tech.ChEBML_1563
IC50 180±n/a nM
Citation Sanner, MAChappie, TADunaiskis, ARFliri, AFDesai, KAZorn, SHJackson, ERJohnson, CGMorrone, JMSeymour, PAMajchrzak, MJFaraci, WSCollins, JLDuignan, DBPrete Di, CCLee, JSTrozzi, A Synthesis, SAR and pharmacology of CP-293,019: a potent, selective dopamine D4 receptor antagonist. Bioorg Med Chem Lett8:725-30 (1999) 5-hydroxytryptamine receptor 1A
Name:5-hydroxytryptamine receptor 1A
Type:Enzyme
Mol. Mass.:46192.09
Organism:Mus musculus (Mouse)
Description:Q64264
Residue:421
BDBM50069041
NameBDBM50069041
Synonyms:(7R,9aS)-7-(4-Fluoro-phenoxymethyl)-2-(5-fluoro-pyrimidin-2-yl)-octahydro-pyrido[1,2-a]pyrazine CHEMBL66227 | CP-293019
TypeSmall organic molecule
Emp. Form.C19H22F2N4O
Mol. Mass.360.401
SMILESFc1ccc(OC[C@@H]2CC[C@H]3CN(CCN3C2)c2ncc(F)cn2)cc1