Reaction Details
TargetD(4) dopamine receptor
LigandBDBM50069042
Substrate/Competitorn/a
Meas. Tech.ChEBML_58935
Ki 5.3±n/a nM
Citation Sanner, MAChappie, TADunaiskis, ARFliri, AFDesai, KAZorn, SHJackson, ERJohnson, CGMorrone, JMSeymour, PAMajchrzak, MJFaraci, WSCollins, JLDuignan, DBPrete Di, CCLee, JSTrozzi, A Synthesis, SAR and pharmacology of CP-293,019: a potent, selective dopamine D4 receptor antagonist. Bioorg Med Chem Lett8:725-30 (1999) D(4) dopamine receptor
Name:D(4) dopamine receptor
Type:Enzyme
Mol. Mass.:48373.19
Organism:Homo sapiens (Human)
Description:P21917
Residue:419
BDBM50069042
NameBDBM50069042
Synonyms:(7R,9aS)-7-(4-Fluoro-phenoxymethyl)-2-(4-fluoro-phenyl)-octahydro-pyrido[1,2-a]pyrazine | CHEMBL166321
TypeSmall organic molecule
Emp. Form.C21H24F2N2O
Mol. Mass.358.4249
SMILESFc1ccc(OC[C@@H]2CC[C@H]3CN(CCN3C2)c2ccc(F)cc2)cc1