Reaction Details
TargetD(2) dopamine receptor
LigandBDBM50069041
Substrate/Competitorn/a
Meas. Tech.ChEBML_58463
Ki>3310±n/a nM
Citation Sanner, MAChappie, TADunaiskis, ARFliri, AFDesai, KAZorn, SHJackson, ERJohnson, CGMorrone, JMSeymour, PAMajchrzak, MJFaraci, WSCollins, JLDuignan, DBPrete Di, CCLee, JSTrozzi, A Synthesis, SAR and pharmacology of CP-293,019: a potent, selective dopamine D4 receptor antagonist. Bioorg Med Chem Lett8:725-30 (1999) D(2) dopamine receptor
Name:D(2) dopamine receptor
Type:Cell-surface receptors
Mol. Mass.:50647.10
Organism:Homo sapiens (Human)
Description:P14416
Residue:443
BDBM50069041
NameBDBM50069041
Synonyms:(7R,9aS)-7-(4-Fluoro-phenoxymethyl)-2-(5-fluoro-pyrimidin-2-yl)-octahydro-pyrido[1,2-a]pyrazine CHEMBL66227 | CP-293019
TypeSmall organic molecule
Emp. Form.C19H22F2N4O
Mol. Mass.360.401
SMILESFc1ccc(OC[C@@H]2CC[C@H]3CN(CCN3C2)c2ncc(F)cn2)cc1