Reaction Details
TargetD(4) dopamine receptor
LigandBDBM50001884
Substrate/Competitorn/a
Meas. Tech.ChEBML_58935
Ki 47±n/a nM
Citation Sanner, MAChappie, TADunaiskis, ARFliri, AFDesai, KAZorn, SHJackson, ERJohnson, CGMorrone, JMSeymour, PAMajchrzak, MJFaraci, WSCollins, JLDuignan, DBPrete Di, CCLee, JSTrozzi, A Synthesis, SAR and pharmacology of CP-293,019: a potent, selective dopamine D4 receptor antagonist. Bioorg Med Chem Lett8:725-30 (1999) D(4) dopamine receptor
Name:D(4) dopamine receptor
Type:Enzyme
Mol. Mass.:48373.19
Organism:Homo sapiens (Human)
Description:P21917
Residue:419
BDBM50001884
NameBDBM50001884
Synonyms:2-[4-(4-Methyl-benzyl)-piperazin-1-yl]-1-(2-methyl-2,3-dihydro-indol-1-yl)-ethanone 3-chloro-6-(4-methyl-piperazin-1-yl)-5H-dibenzo[b,e][1,4]diazepine 8-Chloro-11-(4-methyl-piperazin-1-yl)-5H-dibenzo[b,e][1,4]diazepine( Clozepine ) 8-Chloro-11-(4-methyl-piperazin-1-yl)-5H-dibenzo[b,e][1,4]diazepine(Clopazine) 8-chloro-11-(4-methylpiperazin-1-yl)-5H-dibenzo[b,e][1,4]diazepine CHEMBL538973 CLOZAPINE, 8-CHLORO-11-(4-METHYL-PIPERAZIN-1-YL)-5H-DIBENZO[B,E][1,4]DIAZEPINE HF 1854 US10752588, Compound Clozapine | US11498896, Compound Clozapine
TypeSmall organic molecule
Emp. Form.C18H19ClN4
Mol. Mass.326.823
SMILESCN1CCN(CC1)C1=Nc2cc(Cl)ccc2Nc2ccccc12