Reaction Details
TargetD(4) dopamine receptor
LigandBDBM50069035
Substrate/Competitorn/a
Meas. Tech.ChEBML_58935
Ki 1.6±n/a nM
Citation Sanner, MAChappie, TADunaiskis, ARFliri, AFDesai, KAZorn, SHJackson, ERJohnson, CGMorrone, JMSeymour, PAMajchrzak, MJFaraci, WSCollins, JLDuignan, DBPrete Di, CCLee, JSTrozzi, A Synthesis, SAR and pharmacology of CP-293,019: a potent, selective dopamine D4 receptor antagonist. Bioorg Med Chem Lett8:725-30 (1999) D(4) dopamine receptor
Name:D(4) dopamine receptor
Type:Enzyme
Mol. Mass.:48373.19
Organism:Homo sapiens (Human)
Description:P21917
Residue:419
BDBM50069035
NameBDBM50069035
Synonyms:(7R,9aS)-7-Phenoxymethyl-2-phenyl-octahydro-pyrido[1,2-a]pyrazine | CHEMBL351611
TypeSmall organic molecule
Emp. Form.C21H26N2O
Mol. Mass.322.4439
SMILESC(Oc1ccccc1)[C@@H]1CC[C@H]2CN(CCN2C1)c1ccccc1