Reaction Details
TargetPeroxisomal sarcosine oxidase
LigandBDBM50069058
Substrate/Competitorn/a
Meas. Tech.ChEBML_92610
IC50 200000±n/a nM
Citation Ho, BZabriskie, TM Epoxide derivatives of pipecolic acid and proline are inhibitors of pipecolate oxidase. Bioorg Med Chem Lett8:739-44 (1999) Peroxisomal sarcosine oxidase
Name:Peroxisomal sarcosine oxidase
Type:PROTEIN
Mol. Mass.:44078.97
Organism:Homo sapiens (Human)
Description:ChEMBL_92614
Residue:390
BDBM50069058
NameBDBM50069058
Synonyms:(1R,2S,5S)-6-Oxa-3-aza-bicyclo[3.1.0]hexane-2-carboxylic acid | CHEMBL353345
TypeSmall organic molecule
Emp. Form.C5H7NO3
Mol. Mass.129.114
SMILESOC(=O)[C@H]1NC[C@@H]2O[C@H]12