Reaction Details
TargetProthrombin
LigandBDBM50069162
Substrate/Competitorn/a
Meas. Tech.ChEBML_210652
Ki 35.0±n/a nM
Citation Duncia, JVSantella, JBHigley, CAVanAtten, MKWeber, PCAlexander, RSKettner, CAPruitt, JRLiauw, AYQuan, MLKnabb, RMWexler, RR Pyrazoles, 1,2,4-triazoles, and tetrazoles as surrogates for cis-amide bonds in boronate ester thrombin inhibitors. Bioorg Med Chem Lett8:775-80 (1999) Prothrombin
Name:Prothrombin
Type:Protein
Mol. Mass.:70029.57
Organism:Homo sapiens (Human)
Description:P00734
Residue:622
BDBM50069162
NameBDBM50069162
Synonyms:CHEMBL2373351 | N-[(R)-5-Amino-1-((1S,2S,6R,8S)-2,9,9-trimethyl-3,5-dioxa-4-bora-tricyclo[6.1.1.0*2,6*]dec-4-yl)-pentyl]-2-(3-cyanomethyl-5-phenethyl-pyrazol-1-yl)-acetamide
TypeSmall organic molecule
Emp. Form.C30H42BN5O3
Mol. Mass.531.497
SMILES[H][C@@]12C[C@@]([H])(C1(C)C)[C@]1(C)OB(O[C@]1([H])C2)[C@H](CCCCN)NC(=O)Cn1nc(CC#N)cc1CCc1ccccc1