Reaction Details
TargetSerine protease 1
LigandBDBM50069145
Substrate/Competitorn/a
Meas. Tech.ChEMBL_210652 (CHEMBL811614)
Ki 150±n/a nM
Citation Duncia, JVSantella, JBHigley, CAVanAtten, MKWeber, PCAlexander, RSKettner, CAPruitt, JRLiauw, AYQuan, MLKnabb, RMWexler, RR Pyrazoles, 1,2,4-triazoles, and tetrazoles as surrogates for cis-amide bonds in boronate ester thrombin inhibitors. Bioorg Med Chem Lett8:775-80 (1999) Serine protease 1
Name:Serine protease 1
Type:Enzyme
Mol. Mass.:26557.80
Organism:Homo sapiens (Human)
Description:P07477
Residue:247
BDBM50069145
NameBDBM50069145
Synonyms:2-[3-(3-Amino-phenyl)-5-benzyl-[1,2,4]triazol-1-yl]-N-[(R)-5-amino-1-((1S,2S,6R,8S)-2,9,9-trimethyl-3,5-dioxa-4-bora-tricyclo[6.1.1.0*2,6*]dec-4-yl)-pentyl]-acetamide | CHEMBL2373348
TypeSmall organic molecule
Emp. Form.C32H43BN6O3
Mol. Mass.570.533
SMILES[H][C@@]12C[C@@]([H])(C1(C)C)[C@]1(C)OB(O[C@]1([H])C2)[C@H](CCCCN)NC(=O)Cn1nc(nc1Cc1ccccc1)-c1cccc(N)c1