Reaction Details
TargetProthrombin
LigandBDBM50069172
Substrate/Competitorn/a
Meas. Tech.ChEBML_210652
Ki 0.300000±n/a nM
Citation Duncia, JVSantella, JBHigley, CAVanAtten, MKWeber, PCAlexander, RSKettner, CAPruitt, JRLiauw, AYQuan, MLKnabb, RMWexler, RR Pyrazoles, 1,2,4-triazoles, and tetrazoles as surrogates for cis-amide bonds in boronate ester thrombin inhibitors. Bioorg Med Chem Lett8:775-80 (1999) Prothrombin
Name:Prothrombin
Type:Protein
Mol. Mass.:70029.57
Organism:Homo sapiens (Human)
Description:P00734
Residue:622
BDBM50069172
NameBDBM50069172
Synonyms:Boronate Ester analogue | CHEMBL423259
TypeSmall organic molecule
Emp. Form.C17H27BN4O4S
Mol. Mass.394.297
SMILESCN(CC(=O)N[C@@H](CCCSC(N)=N)B(O)O)C(=O)CCc1ccccc1