Reaction Details
TargetSerine protease 1
LigandBDBM50069147
Substrate/Competitorn/a
Meas. Tech.ChEMBL_210652 (CHEMBL811614)
Ki 36±n/a nM
Citation Duncia, JVSantella, JBHigley, CAVanAtten, MKWeber, PCAlexander, RSKettner, CAPruitt, JRLiauw, AYQuan, MLKnabb, RMWexler, RR Pyrazoles, 1,2,4-triazoles, and tetrazoles as surrogates for cis-amide bonds in boronate ester thrombin inhibitors. Bioorg Med Chem Lett8:775-80 (1999) Serine protease 1
Name:Serine protease 1
Type:Enzyme
Mol. Mass.:26557.80
Organism:Homo sapiens (Human)
Description:P07477
Residue:247
BDBM50069147
NameBDBM50069147
Synonyms:(E)-3-(1-{[(R)-5-Amino-1-((1S,2S,6R,8S)-2,9,9-trimethyl-3,5-dioxa-4-bora-tricyclo[6.1.1.0*2,6*]dec-4-yl)-pentylcarbamoyl]-methyl}-5-benzyl-1H-[1,2,4]triazol-3-yl)-acrylic acid tert-butyl ester | CHEMBL2373345
TypeSmall organic molecule
Emp. Form.C33H48BN5O5
Mol. Mass.605.576
SMILES[H][C@@]12C[C@@]([H])(C1(C)C)[C@]1(C)OB(O[C@]1([H])C2)[C@H](CCCCN)NC(=O)Cn1nc(\C=C\C(=O)OC(C)(C)C)nc1Cc1ccccc1