Reaction Details
TargetProthrombin
LigandBDBM50069191
Substrate/Competitorn/a
Meas. Tech.ChEBML_208320
Ki 2.3±n/a nM
Citation Sanderson, PECutrona, KJDorsey, BDDyer, DLMcDonough, CMNaylor-Olsen, AMChen, IWChen, ZCook, JJGardell, SJKrueger, JALewis, SDLin, JHLucas, BJLyle, EALynch, JJStranieri, MTVastag, KShafer, JAVacca, JP L-374,087, an efficacious, orally bioavailable, pyridinone acetamide thrombin inhibitor. Bioorg Med Chem Lett8:817-22 (1999) Prothrombin
Name:Prothrombin
Type:Protein
Mol. Mass.:70029.57
Organism:Homo sapiens (Human)
Description:P00734
Residue:622
BDBM50069191
NameBDBM50069191
Synonyms:CHEMBL349430 | N-(6-Amino-2-methyl-pyridin-3-ylmethyl)-2-(6-methyl-2-oxo-3-phenethylamino-2H-pyridin-1-yl)-acetamide
TypeSmall organic molecule
Emp. Form.C23H27N5O2
Mol. Mass.405.4928
SMILESCc1nc(N)ccc1CNC(=O)Cn1c(C)ccc(NCCc2ccccc2)c1=O