Reaction Details
TargetGag-Pol polyprotein [489-587]
LigandBDBM50069199
Substrate/Competitorn/a
Meas. Tech.ChEBML_80092
Ki 0.059000±n/a nM
Citation Patel, MBacheler, LTRayner, MMCordova, BCKlabe, RMErickson-Viitanen, SSeitz, SP The synthesis and evaluation of cyclic ureas as HIV protease inhibitors: modifications of the P1/P1' residues. Bioorg Med Chem Lett8:823-8 (1999) Gag-Pol polyprotein [489-587]
Name:Gag-Pol polyprotein [489-587]
Type:Enzyme Subunit
Mol. Mass.:10781.16
Organism:Human immunodeficiency virus type 1
Description:P04585[489-587]
Residue:99
BDBM50069199
NameBDBM50069199
Synonyms:(4R,5S,6S,7R)-5,6-Dihydroxy-4,7-bis-[4-(2-hydroxy-ethoxy)-benzyl]-1,3-bis-[3-(1H-pyrazol-3-yl)-benzyl]-[1,3]diazepan-2-one | CHEMBL446691
TypeSmall organic molecule
Emp. Form.C43H46N6O7
Mol. Mass.758.8613
SMILESOCCOc1ccc(C[C@@H]2[C@H](O)[C@@H](O)[C@@H](Cc3ccc(OCCO)cc3)N(Cc3cccc(c3)-c3cc[nH]n3)C(=O)N2Cc2cccc(c2)-c2cc[nH]n2)cc1