Reaction Details
TargetGag-Pol polyprotein [489-587]
LigandBDBM151
Substrate/Competitorn/a
Meas. Tech.ChEBML_80092
Ki 0.280000±n/a nM
Citation Patel, MBacheler, LTRayner, MMCordova, BCKlabe, RMErickson-Viitanen, SSeitz, SP The synthesis and evaluation of cyclic ureas as HIV protease inhibitors: modifications of the P1/P1' residues. Bioorg Med Chem Lett8:823-8 (1999) Gag-Pol polyprotein [489-587]
Name:Gag-Pol polyprotein [489-587]
Type:Enzyme Subunit
Mol. Mass.:10781.16
Organism:Human immunodeficiency virus type 1
Description:P04585[489-587]
Residue:99
BDBM151
NameBDBM151
Synonyms:(4R,5S,6S,7R)-1,3-bis[(3-aminophenyl)methyl]-4,7-dibenzyl-5,6-dihydroxy-1,3-diazepan-2-one DMP450
Typen/a
Emp. Form.C33H36N4O3
Mol. Mass.536.6639
SMILESNc1cccc(CN2[C@H](Cc3ccccc3)[C@H](O)[C@@H](O)[C@@H](Cc3ccccc3)N(Cc3cccc(N)c3)C2=O)c1